{"text_format":"1","workbook":"xlsx","n_sheets":4,"sheets":["Di Bruno Order Form","Gift Messages","2018 Gift List","CoGi Offering_2016"],"not_rendered":{"charts":0,"images":1,"macros":1,"external_links":2,"defined_names":12,"comments":0,"pivot_tables":0},"unopened":[],"bounds":{"document_bytes":16777216,"sheet_cells":100000,"rows_first":2000,"rows_last":500,"rows_between":2000,"halvings":0,"cell_chars":16384,"cell_head_chars":4096},"cells_cut":0,"cells_raw":0,"read":"whole","date_system":"1900"}

{"sheet":"Di Bruno Order Form","index":0,"n_rows":452,"n_cols":14,"rows_kept":452,"cut":false,"hidden":false,"merged":[[9,5,9,12],[10,5,10,12],[4,1,4,4],[5,1,5,4],[6,1,6,4],[7,1,7,4],[8,1,8,4],[9,0,10,0],[9,1,10,4],[11,0,11,12],[0,0,0,4],[0,5,0,12],[1,5,1,12],[3,1,3,4],[2,5,2,12],[1,0,1,4],[2,1,2,4],[3,5,3,12],[4,5,4,12],[5,5,5,12],[6,5,6,12],[7,5,7,12],[8,5,8,12]]}
[null,null,null,null,null,"Corporate Gifting Order Form \n215.599.1363 ext. 2         Corporate@dibruno.com "]
["CUSTOMER CONTACT INFORMATION:",null,null,null,null,"Please read the important instructions below. "]
["Company Name*",null,null,null,null,"Your order will be downloaded from this order form electronically, so it is critical that you complete the form following all data entry guidelines to avoid processing errors."]
["Contact Name*",null,null,null,null,"1. Please make sure to fill in the contact and billing information for you and your company. The document will not allow you to save and quit until boxes B3-B9 are completed!"]
["Billing Address:",null,null,null,null,"2. Please make sure the ADDRESS 1 field has numerical values and street addresses.  We are unable to send to PO Boxes at this time. "]
["City, State, Zip:",null,null,null,null,"3. Please include a phone number for the recipient.  If you don't have it, please include your phone number in case of shipping issues. "]
["Phone:",null,null,null,null,"4. Don't forget a gift note message! This is for your gift recipient to know who to thank! "]
["Email Address:",null,null,null,null,"5. Double check all of your addresses and recipient spelling. Additional fees may apply for gifts returned from carrier. "]
["Requested Ship Week:",null,null,null,null,"6. When complete, save this document to your desktop and email it as an attachment to corporate@dibruno.com or your DiBrunos acccount manager."]
["Special Instructions:",null,null,null,null,"7. You will receive a quote within 24 hours to confirm pricing and shipping details. "]
[null,null,null,null,null,"8. An invoice will be generated through PayPal and sent to the email address listed in the contact portion of this document. Payment must be complete for the order to be valid. "]
["ORDER DETAILS:"]
["Recipient Name     (30 Characters Max)","Company Name               (30 Characters Max)","Address 1                       (30 Characters Max)","Address 2","City","State","5 digit Zip Code","Phone Number","Home or Office?","Gift Choice","Gift Price","Choose a Gift Message Here!","Add Your Signature "]
["EXAMPLE: John Doe","Doe Corporations","1234 Blank Road","Suite 567","Blanks","PA",12345,"215-123-4657","Office","Extravaganza- BASK002",299.99,"Congratulations!","From, Your Friends at Google ","Happy Thanksgiving! "]
[null,null,null,null,null,null,null,null,null,null,{"$f":"IFERROR(VLOOKUP(J15,'2018 Gift List'!$A$3:$B$30,2,FALSE),\"\")","v":""},null,null,"Happy Holidays!"]
[null,null,null,null,null,null,null,null,null,null,{"$f":"IFERROR(VLOOKUP(J16,'2018 Gift List'!$A$3:$B$30,2,FALSE),\"\")","v":""},null,null,"Seasons Greetings! "]
[null,null,null,null,null,null,null,null,null,null,{"$f":"IFERROR(VLOOKUP(J17,'2018 Gift List'!$A$3:$B$30,2,FALSE),\"\")","v":""},null,null,"Merry Christmas!"]
[null,null,null,null,null,null,null,null,null,null,{"$f":"IFERROR(VLOOKUP(J18,'2018 Gift List'!$A$3:$B$30,2,FALSE),\"\")","v":""},null,null,"Happy Hanukkah! "]
[null,null,null,null,null,null,null,null,null,null,{"$f":"IFERROR(VLOOKUP(J19,'2018 Gift List'!$A$3:$B$30,2,FALSE),\"\")","v":""},null,null,"Happy New Year! "]
[null,null,null,null,null,null,null,null,null,null,{"$f":"IFERROR(VLOOKUP(J20,'2018 Gift List'!$A$3:$B$30,2,FALSE),\"\")","v":""},null,null,"Handwritten/Provide to Di Bruno Bros."]
[null,null,null,null,null,null,null,null,null,null,{"$f":"IFERROR(VLOOKUP(J21,'2018 Gift List'!$A$3:$B$30,2,FALSE),\"\")","v":""},null,null,"Custom -Contact Gifting Specalist for Details-  Corporate@Dibruno.com"]
[null,null,null,null,null,null,null,null,null,null,{"$f":"IFERROR(VLOOKUP(J22,'2018 Gift List'!$A$3:$B$30,2,FALSE),\"\")","v":""}]
[null,null,null,null,null,null,null,null,null,null,{"$f":"IFERROR(VLOOKUP(J23,'2018 Gift List'!$A$3:$B$30,2,FALSE),\"\")","v":""}]
[null,null,null,null,null,null,null,null,null,null,{"$f":"IFERROR(VLOOKUP(J24,'2018 Gift List'!$A$3:$B$30,2,FALSE),\"\")","v":""}]
[null,null,null,null,null,null,null,null,null,null,{"$f":"IFERROR(VLOOKUP(J25,'2018 Gift List'!$A$3:$B$30,2,FALSE),\"\")","v":""}]
[null,null,null,null,null,null,null,null,null,null,{"$f":"IFERROR(VLOOKUP(J26,'2018 Gift List'!$A$3:$B$30,2,FALSE),\"\")","v":""}]
[null,null,null,null,null,null,null,null,null,null,{"$f":"IFERROR(VLOOKUP(J27,'2018 Gift List'!$A$3:$B$30,2,FALSE),\"\")","v":""}]
[null,null,null,null,null,null,null,null,null,null,{"$f":"IFERROR(VLOOKUP(J28,'2018 Gift List'!$A$3:$B$30,2,FALSE),\"\")","v":""}]
[null,null,null,null,null,null,null,null,null,null,{"$f":"IFERROR(VLOOKUP(J29,'2018 Gift List'!$A$3:$B$30,2,FALSE),\"\")","v":""}]
[null,null,null,null,null,null,null,null,null,null,{"$f":"IFERROR(VLOOKUP(J30,'2018 Gift List'!$A$3:$B$30,2,FALSE),\"\")","v":""}]
[null,null,null,null,null,null,null,null,null,null,{"$f":"IFERROR(VLOOKUP(J31,'2018 Gift List'!$A$3:$B$30,2,FALSE),\"\")","v":""}]
[null,null,null,null,null,null,null,null,null,null,{"$f":"IFERROR(VLOOKUP(J32,'2018 Gift List'!$A$3:$B$30,2,FALSE),\"\")","v":""}]
[null,null,null,null,null,null,null,null,null,null,{"$f":"IFERROR(VLOOKUP(J33,'2018 Gift List'!$A$3:$B$30,2,FALSE),\"\")","v":""}]
[null,null,null,null,null,null,null,null,null,null,{"$f":"IFERROR(VLOOKUP(J34,'2018 Gift List'!$A$3:$B$30,2,FALSE),\"\")","v":""}]
[null,null,null,null,null,null,null,null,null,null,{"$f":"IFERROR(VLOOKUP(J35,'2018 Gift List'!$A$3:$B$30,2,FALSE),\"\")","v":""}]
[null,null,null,null,null,null,null,null,null,null,{"$f":"IFERROR(VLOOKUP(J36,'2018 Gift List'!$A$3:$B$30,2,FALSE),\"\")","v":""}]
[null,null,null,null,null,null,null,null,null,null,{"$f":"IFERROR(VLOOKUP(J37,'2018 Gift List'!$A$3:$B$30,2,FALSE),\"\")","v":""}]
[null,null,null,null,null,null,null,null,null,null,{"$f":"IFERROR(VLOOKUP(J38,'2018 Gift List'!$A$3:$B$30,2,FALSE),\"\")","v":""}]
[null,null,null,null,null,null,null,null,null,null,{"$f":"IFERROR(VLOOKUP(J39,'2018 Gift List'!$A$3:$B$30,2,FALSE),\"\")","v":""}]
[null,null,null,null,null,null,null,null,null,null,{"$f":"IFERROR(VLOOKUP(J40,'2018 Gift List'!$A$3:$B$30,2,FALSE),\"\")","v":""}]
[null,null,null,null,null,null,null,null,null,null,{"$f":"IFERROR(VLOOKUP(J41,'2018 Gift List'!$A$3:$B$30,2,FALSE),\"\")","v":""}]
[null,null,null,null,null,null,null,null,null,null,{"$f":"IFERROR(VLOOKUP(J42,'2018 Gift List'!$A$3:$B$30,2,FALSE),\"\")","v":""}]
[null,null,null,null,null,null,null,null,null,null,{"$f":"IFERROR(VLOOKUP(J43,'2018 Gift List'!$A$3:$B$30,2,FALSE),\"\")","v":""}]
[null,null,null,null,null,null,null,null,null,null,{"$f":"IFERROR(VLOOKUP(J44,'2018 Gift List'!$A$3:$B$30,2,FALSE),\"\")","v":""}]
[null,null,null,null,null,null,null,null,null,null,{"$f":"IFERROR(VLOOKUP(J45,'2018 Gift List'!$A$3:$B$30,2,FALSE),\"\")","v":""}]
[null,null,null,null,null,null,null,null,null,null,{"$f":"IFERROR(VLOOKUP(J46,'2018 Gift List'!$A$3:$B$30,2,FALSE),\"\")","v":""}]
[null,null,null,null,null,null,null,null,null,null,{"$f":"IFERROR(VLOOKUP(J47,'2018 Gift List'!$A$3:$B$30,2,FALSE),\"\")","v":""}]
[null,null,null,null,null,null,null,null,null,null,{"$f":"IFERROR(VLOOKUP(J48,'2018 Gift List'!$A$3:$B$30,2,FALSE),\"\")","v":""}]
[null,null,null,null,null,null,null,null,null,null,{"$f":"IFERROR(VLOOKUP(J49,'2018 Gift List'!$A$3:$B$30,2,FALSE),\"\")","v":""}]
[null,null,null,null,null,null,null,null,null,null,{"$f":"IFERROR(VLOOKUP(J50,'2018 Gift List'!$A$3:$B$30,2,FALSE),\"\")","v":""}]
[null,null,null,null,null,null,null,null,null,null,{"$f":"IFERROR(VLOOKUP(J51,'2018 Gift List'!$A$3:$B$30,2,FALSE),\"\")","v":""}]
[null,null,null,null,null,null,null,null,null,null,{"$f":"IFERROR(VLOOKUP(J52,'2018 Gift List'!$A$3:$B$30,2,FALSE),\"\")","v":""}]
[null,null,null,null,null,null,null,null,null,null,{"$f":"IFERROR(VLOOKUP(J53,'2018 Gift List'!$A$3:$B$30,2,FALSE),\"\")","v":""}]
[null,null,null,null,null,null,null,null,null,null,{"$f":"IFERROR(VLOOKUP(J54,'2018 Gift List'!$A$3:$B$30,2,FALSE),\"\")","v":""}]
[null,null,null,null,null,null,null,null,null,null,{"$f":"IFERROR(VLOOKUP(J55,'2018 Gift List'!$A$3:$B$30,2,FALSE),\"\")","v":""}]
[null,null,null,null,null,null,null,null,null,null,{"$f":"IFERROR(VLOOKUP(J56,'2018 Gift List'!$A$3:$B$30,2,FALSE),\"\")","v":""}]
[null,null,null,null,null,null,null,null,null,null,{"$f":"IFERROR(VLOOKUP(J57,'2018 Gift List'!$A$3:$B$30,2,FALSE),\"\")","v":""}]
[null,null,null,null,null,null,null,null,null,null,{"$f":"IFERROR(VLOOKUP(J58,'2018 Gift List'!$A$3:$B$30,2,FALSE),\"\")","v":""}]
[null,null,null,null,null,null,null,null,null,null,{"$f":"IFERROR(VLOOKUP(J59,'2018 Gift List'!$A$3:$B$30,2,FALSE),\"\")","v":""}]
[null,null,null,null,null,null,null,null,null,null,{"$f":"IFERROR(VLOOKUP(J60,'2018 Gift List'!$A$3:$B$30,2,FALSE),\"\")","v":""}]
[null,null,null,null,null,null,null,null,null,null,{"$f":"IFERROR(VLOOKUP(J61,'2018 Gift List'!$A$3:$B$30,2,FALSE),\"\")","v":""}]
[null,null,null,null,null,null,null,null,null,null,{"$f":"IFERROR(VLOOKUP(J62,'2018 Gift List'!$A$3:$B$30,2,FALSE),\"\")","v":""}]
[null,null,null,null,null,null,null,null,null,null,{"$f":"IFERROR(VLOOKUP(J63,'2018 Gift List'!$A$3:$B$30,2,FALSE),\"\")","v":""}]
[null,null,null,null,null,null,null,null,null,null,{"$f":"IFERROR(VLOOKUP(J64,'2018 Gift List'!$A$3:$B$30,2,FALSE),\"\")","v":""}]
[null,null,null,null,null,null,null,null,null,null,{"$f":"IFERROR(VLOOKUP(J65,'2018 Gift List'!$A$3:$B$30,2,FALSE),\"\")","v":""}]
[null,null,null,null,null,null,null,null,null,null,{"$f":"IFERROR(VLOOKUP(J66,'2018 Gift List'!$A$3:$B$30,2,FALSE),\"\")","v":""}]
[null,null,null,null,null,null,null,null,null,null,{"$f":"IFERROR(VLOOKUP(J67,'2018 Gift List'!$A$3:$B$30,2,FALSE),\"\")","v":""}]
[null,null,null,null,null,null,null,null,null,null,{"$f":"IFERROR(VLOOKUP(J68,'2018 Gift List'!$A$3:$B$30,2,FALSE),\"\")","v":""}]
[null,null,null,null,null,null,null,null,null,null,{"$f":"IFERROR(VLOOKUP(J69,'2018 Gift List'!$A$3:$B$30,2,FALSE),\"\")","v":""}]
[null,null,null,null,null,null,null,null,null,null,{"$f":"IFERROR(VLOOKUP(J70,'2018 Gift List'!$A$3:$B$30,2,FALSE),\"\")","v":""}]
[null,null,null,null,null,null,null,null,null,null,{"$f":"IFERROR(VLOOKUP(J71,'2018 Gift List'!$A$3:$B$30,2,FALSE),\"\")","v":""}]
[null,null,null,null,null,null,null,null,null,null,{"$f":"IFERROR(VLOOKUP(J72,'2018 Gift List'!$A$3:$B$30,2,FALSE),\"\")","v":""}]
[null,null,null,null,null,null,null,null,null,null,{"$f":"IFERROR(VLOOKUP(J73,'2018 Gift List'!$A$3:$B$30,2,FALSE),\"\")","v":""}]
[null,null,null,null,null,null,null,null,null,null,{"$f":"IFERROR(VLOOKUP(J74,'2018 Gift List'!$A$3:$B$30,2,FALSE),\"\")","v":""}]
[null,null,null,null,null,null,null,null,null,null,{"$f":"IFERROR(VLOOKUP(J75,'2018 Gift List'!$A$3:$B$30,2,FALSE),\"\")","v":""}]
[null,null,null,null,null,null,null,null,null,null,{"$f":"IFERROR(VLOOKUP(J76,'2018 Gift List'!$A$3:$B$30,2,FALSE),\"\")","v":""}]
[null,null,null,null,null,null,null,null,null,null,{"$f":"IFERROR(VLOOKUP(J77,'2018 Gift List'!$A$3:$B$30,2,FALSE),\"\")","v":""}]
[null,null,null,null,null,null,null,null,null,null,{"$f":"IFERROR(VLOOKUP(J78,'2018 Gift List'!$A$3:$B$30,2,FALSE),\"\")","v":""}]
[null,null,null,null,null,null,null,null,null,null,{"$f":"IFERROR(VLOOKUP(J79,'2018 Gift List'!$A$3:$B$30,2,FALSE),\"\")","v":""}]
[null,null,null,null,null,null,null,null,null,null,{"$f":"IFERROR(VLOOKUP(J80,'2018 Gift List'!$A$3:$B$30,2,FALSE),\"\")","v":""}]
[null,null,null,null,null,null,null,null,null,null,{"$f":"IFERROR(VLOOKUP(J81,'2018 Gift List'!$A$3:$B$30,2,FALSE),\"\")","v":""}]
[null,null,null,null,null,null,null,null,null,null,{"$f":"IFERROR(VLOOKUP(J82,'2018 Gift List'!$A$3:$B$30,2,FALSE),\"\")","v":""}]
[null,null,null,null,null,null,null,null,null,null,{"$f":"IFERROR(VLOOKUP(J83,'2018 Gift List'!$A$3:$B$30,2,FALSE),\"\")","v":""}]
[null,null,null,null,null,null,null,null,null,null,{"$f":"IFERROR(VLOOKUP(J84,'2018 Gift List'!$A$3:$B$30,2,FALSE),\"\")","v":""}]
[null,null,null,null,null,null,null,null,null,null,{"$f":"IFERROR(VLOOKUP(J85,'2018 Gift List'!$A$3:$B$30,2,FALSE),\"\")","v":""}]
[null,null,null,null,null,null,null,null,null,null,{"$f":"IFERROR(VLOOKUP(J86,'2018 Gift List'!$A$3:$B$30,2,FALSE),\"\")","v":""}]
[null,null,null,null,null,null,null,null,null,null,{"$f":"IFERROR(VLOOKUP(J87,'2018 Gift List'!$A$3:$B$30,2,FALSE),\"\")","v":""}]
[null,null,null,null,null,null,null,null,null,null,{"$f":"IFERROR(VLOOKUP(J88,'2018 Gift List'!$A$3:$B$30,2,FALSE),\"\")","v":""}]
[null,null,null,null,null,null,null,null,null,null,{"$f":"IFERROR(VLOOKUP(J89,'2018 Gift List'!$A$3:$B$30,2,FALSE),\"\")","v":""}]
[null,null,null,null,null,null,null,null,null,null,{"$f":"IFERROR(VLOOKUP(J90,'2018 Gift List'!$A$3:$B$30,2,FALSE),\"\")","v":""}]
[null,null,null,null,null,null,null,null,null,null,{"$f":"IFERROR(VLOOKUP(J91,'2018 Gift List'!$A$3:$B$30,2,FALSE),\"\")","v":""}]
[null,null,null,null,null,null,null,null,null,null,{"$f":"IFERROR(VLOOKUP(J92,'2018 Gift List'!$A$3:$B$30,2,FALSE),\"\")","v":""}]
[null,null,null,null,null,null,null,null,null,null,{"$f":"IFERROR(VLOOKUP(J93,'2018 Gift List'!$A$3:$B$30,2,FALSE),\"\")","v":""}]
[null,null,null,null,null,null,null,null,null,null,{"$f":"IFERROR(VLOOKUP(J94,'2018 Gift List'!$A$3:$B$30,2,FALSE),\"\")","v":""}]
[null,null,null,null,null,null,null,null,null,null,{"$f":"IFERROR(VLOOKUP(J95,'2018 Gift List'!$A$3:$B$30,2,FALSE),\"\")","v":""}]
[null,null,null,null,null,null,null,null,null,null,{"$f":"IFERROR(VLOOKUP(J96,'2018 Gift List'!$A$3:$B$30,2,FALSE),\"\")","v":""}]
[null,null,null,null,null,null,null,null,null,null,{"$f":"IFERROR(VLOOKUP(J97,'2018 Gift List'!$A$3:$B$30,2,FALSE),\"\")","v":""}]
[null,null,null,null,null,null,null,null,null,null,{"$f":"IFERROR(VLOOKUP(J98,'2018 Gift List'!$A$3:$B$30,2,FALSE),\"\")","v":""}]
[null,null,null,null,null,null,null,null,null,null,{"$f":"IFERROR(VLOOKUP(J99,'2018 Gift List'!$A$3:$B$30,2,FALSE),\"\")","v":""}]
[null,null,null,null,null,null,null,null,null,null,{"$f":"IFERROR(VLOOKUP(J100,'2018 Gift List'!$A$3:$B$30,2,FALSE),\"\")","v":""}]
[null,null,null,null,null,null,null,null,null,null,{"$f":"IFERROR(VLOOKUP(J101,'2018 Gift List'!$A$3:$B$30,2,FALSE),\"\")","v":""}]
[null,null,null,null,null,null,null,null,null,null,{"$f":"IFERROR(VLOOKUP(J102,'2018 Gift List'!$A$3:$B$30,2,FALSE),\"\")","v":""}]
[null,null,null,null,null,null,null,null,null,null,{"$f":"IFERROR(VLOOKUP(J103,'2018 Gift List'!$A$3:$B$30,2,FALSE),\"\")","v":""}]
[null,null,null,null,null,null,null,null,null,null,{"$f":"IFERROR(VLOOKUP(J104,'2018 Gift List'!$A$3:$B$30,2,FALSE),\"\")","v":""}]
[null,null,null,null,null,null,null,null,null,null,{"$f":"IFERROR(VLOOKUP(J105,'2018 Gift List'!$A$3:$B$30,2,FALSE),\"\")","v":""}]
[null,null,null,null,null,null,null,null,null,null,{"$f":"IFERROR(VLOOKUP(J106,'2018 Gift List'!$A$3:$B$30,2,FALSE),\"\")","v":""}]
[null,null,null,null,null,null,null,null,null,null,{"$f":"IFERROR(VLOOKUP(J107,'2018 Gift List'!$A$3:$B$30,2,FALSE),\"\")","v":""}]
[null,null,null,null,null,null,null,null,null,null,{"$f":"IFERROR(VLOOKUP(J108,'2018 Gift List'!$A$3:$B$30,2,FALSE),\"\")","v":""}]
[null,null,null,null,null,null,null,null,null,null,{"$f":"IFERROR(VLOOKUP(J109,'2018 Gift List'!$A$3:$B$30,2,FALSE),\"\")","v":""}]
[null,null,null,null,null,null,null,null,null,null,{"$f":"IFERROR(VLOOKUP(J110,'2018 Gift List'!$A$3:$B$30,2,FALSE),\"\")","v":""}]
[null,null,null,null,null,null,null,null,null,null,{"$f":"IFERROR(VLOOKUP(J111,'2018 Gift List'!$A$3:$B$30,2,FALSE),\"\")","v":""}]
[null,null,null,null,null,null,null,null,null,null,{"$f":"IFERROR(VLOOKUP(J112,'2018 Gift List'!$A$3:$B$30,2,FALSE),\"\")","v":""}]
[null,null,null,null,null,null,null,null,null,null,{"$f":"IFERROR(VLOOKUP(J113,'2018 Gift List'!$A$3:$B$30,2,FALSE),\"\")","v":""}]
[null,null,null,null,null,null,null,null,null,null,{"$f":"IFERROR(VLOOKUP(J114,'2018 Gift List'!$A$3:$B$30,2,FALSE),\"\")","v":""}]
[null,null,null,null,null,null,null,null,null,null,{"$f":"IFERROR(VLOOKUP(J115,'2018 Gift List'!$A$3:$B$30,2,FALSE),\"\")","v":""}]
[null,null,null,null,null,null,null,null,null,null,{"$f":"IFERROR(VLOOKUP(J116,'2018 Gift List'!$A$3:$B$30,2,FALSE),\"\")","v":""}]
[null,null,null,null,null,null,null,null,null,null,{"$f":"IFERROR(VLOOKUP(J117,'2018 Gift List'!$A$3:$B$30,2,FALSE),\"\")","v":""}]
[null,null,null,null,null,null,null,null,null,null,{"$f":"IFERROR(VLOOKUP(J118,'2018 Gift List'!$A$3:$B$30,2,FALSE),\"\")","v":""}]
[null,null,null,null,null,null,null,null,null,null,{"$f":"IFERROR(VLOOKUP(J119,'2018 Gift List'!$A$3:$B$30,2,FALSE),\"\")","v":""}]
[null,null,null,null,null,null,null,null,null,null,{"$f":"IFERROR(VLOOKUP(J120,'2018 Gift List'!$A$3:$B$30,2,FALSE),\"\")","v":""}]
{"$rows_left_out":333}
{"sheet":"Gift Messages","index":1,"n_rows":50,"n_cols":1,"rows_kept":50,"cut":false,"hidden":false,"merged":[]}
["Gift Messages "]
["Thinking of you!"]
["Hope all is well!"]
["Happy Birthday!"]
["You are aging like a fine wine…and cheese! Happy Birthday :)"]
["Best wishes on your birthday and throughout the coming year."]
["May this be just the beginning of a year filled with wonderful days."]
["Happy Anniversary!"]
["Congratulations!"]
["Congratulations Newlyweds!"]
["Congratulations on your engagement!"]
["Congratulations Homeowner!"]
["Congratulations on your new home!"]
["May your new home be filled with lots of love and laughter."]
["Congratulations Graduate!"]
["Congratulations on your new bundle of joy!"]
["Congratulations on your retirement!"]
["Congratulations on your new job!"]
["Happy house warming!"]
["Best wishes!"]
["Thank you!"]
["Thank you for all you do."]
["With gratitude and best wishes!"]
["Wishing you every happiness!"]
["Wishing you all the best!"]
["Here's to a speedy recovery!"]
["All the best for a speedy recovery."]
["Get well soon."]
["In loving memory."]
["With deepest sympathy."]
["With heartfelt condolences."]
["Sending you love and sympathy, today and always."]
["Our heartfelt sympathies at this most difficult time."]
["All our love."]
["All my love."]
["Happy Valentine's Day!"]
["Happy Easter!"]
["Happy Mother's Day!"]
["Happy Father's Day!"]
["Happy Fourth of July!"]
["Happy Thanksgiving!"]
["Happy Holidays!"]
["Wishing you health and happiness this holiday season."]
["Season's greetings! May you have a peaceful holiday and New Year."]
["Merry Christmas!"]
["Happy Hannukah!"]
["Happy New Year!"]
["[No message - please leave blank]"]
["[CUSTOM: Please contact one of our Gifting Specialists for more details]"]
["[HANDWRITTEN: Please contact one of our Gifting Specialists for more details]"]

{"sheet":"2018 Gift List","index":2,"n_rows":31,"n_cols":2,"rows_kept":31,"cut":false,"hidden":false,"merged":[[0,0,0,1]]}
["2018 Gift List"]
[]
["4 Cheese Sampler - BASK976",39.99]
["Taste of Di Bruno - BASK084",49.99]
["Prov Pepp Box - BASK977\n",59.99]
["Sweet & Salty Bundle - BUND12\n",64.989999999999995]
["Pasta Bundle - BUND02\n",69.989999999999995]
["Pasta and Sauce Crate -BASK069",80]
["Italian Market Tote - BUND20",129.99]
["World Traveler Tote - BUND21",199.99]
["Abbondanza - BASK003\n",79.989999999999995]
["Oil Vinegar - BASK923\n",79.989999999999995]
["Perfect Pairings - BASK035\n",99.99]
["Italian Mkt Crate - BASK090\n",129.99]
["Favoloso - BASK074",149.99]
["World Traveler - BASK092\n",199.99]
["Cucina - BASK978\n",224.99]
["Extravaganza - BASK002\n",299.99]
["The Best of the Best - BASK058\n",299.99]
["The Glorioso - BASK095",399.99]
["Cheddar Bundle - BUND06",79.989999999999995]
["Prima Donna Bundle - BUND14",79.989999999999995]
["Bacon Lover's Bundle -BUND13",84.99]
["Parm Party Bundle - BUND04",84.99]
["Legendairy Cheese Plate  - BASK019",99.99]
["Beer & Bourbon Collection - BASK059",99.99]
["Wine Lover's Collection - BASK067",99.99]
["Italian Cheese Collection - BASK014",99.99]
["Cheesemonger Picks - BASK049",99.99]
["Italian Hoagie Kit - BASK068",124.99]
["CUSTOM: Please contact one of our Gifting Specialists for more details"]

{"sheet":"CoGi Offering_2016","index":3,"n_rows":24,"n_cols":7,"rows_kept":24,"cut":false,"hidden":true,"merged":[]}
["Item Code","Basket Name","Retail ","CoGi Offer","Build Date","Orig. Project.","Cogi Add + Ecomm"]
[]
["BASK018","French ",89.99,"Available for pre-order by Nov. 11th ","2016-10-04",135,137]
["BASK045","HOC Plate",79.989999999999995,"Available for pre-order by Nov. 11th ","2016-10-04",167,177]
["BASK014","Italian Coll",89.99,"Available for pre-order by Nov. 11th ","2016-09-30",195,197]
["BASK013","Red Wine Coll",99.99,"Available for pre-order by Nov. 11th ","2016-09-29",251,268]
["BASK913","White Wine Coll",99.99,"Available for pre-order by Nov. 11th ","2016-10-03",127,144]
["BASK004","Beer Lovers",99.99,"Available for pre-order by Nov. 11th ","2016-10-03",149,166]
["BASK976","3 Cheese",39.99,"FOCUS gift/avail for bulk orders","2016-09-28",573,623]
["BASK084","Taste of Di Bruno",49.99,"FOCUS gift/avail for bulk orders","2016-09-27",1597,1737]
["BASK977","Prov Pepp Box",64.989999999999995,"FOCUS gift/avail for bulk orders","2016-09-20",758,763]
["BASK003","Abbondanza",74.989999999999995,"FOCUS gift/avail for bulk orders","2016-09-26",3238,3504]
["BASK035","VIP Crate",99.99,"FOCUS gift/avail for bulk orders","2016-10-05",1673,1873]
["BASK074","Favoloso",149.99,"FOCUS gift/avail for bulk orders","2016-10-06",879,894]
["BASK978","Cucina",199.99,"FOCUS gift/avail for bulk orders","2016-10-07",392,427]
["BASK002","Extravaganza",299.99,"FOCUS gift/avail for bulk orders","2016-10-10",346,379]
["BASK923","Oil Vinegar",79.989999999999995,"Pantry/Cooking Gift","2016-09-14",144,145]
["BASK015","Pasta & Sauce",69.989999999999995,"Pantry/Cooking Gift","2016-09-15",190,196]
["BASK017","Snack Box",59.99,"Snacks & Sweets","2016-09-19",197,155]
["BASK987","Sweets Box",99.99,"Snacks & Sweets","2016-11-11",109,249]
["BASK093","Bestseller 150 ",149.99,"Specialty *limited time only!","2016-10-11",202,208]
["BASK094","Bestseller 250  ",249.99,"Specialty *limited time only!","2016-11-10",64,72]
["BASK090","Italian Mkt Crate ",124.99,"Specialty *limited time only!","2016-10-17",291,330]
["BASK095","Glorioso",399.99,"Specialty *limited time only!","2016-11-11",8,16]